{"text_format":"1","workbook":"xlsx","n_sheets":8,"sheets":["K-Z","GUNLUK","HALKARZ","Kayıt","AltınDolar","GRAFIK","Temettü","Anlık"],"not_rendered":{"charts":1,"images":0,"macros":1,"external_links":0,"defined_names":6,"comments":0,"pivot_tables":0},"unopened":[],"bounds":{"document_bytes":16777216,"sheet_cells":100000,"rows_first":2000,"rows_last":500,"rows_between":2000,"halvings":0,"cell_chars":16384,"cell_head_chars":4096},"cells_cut":0,"cells_raw":0,"read":"row_number_cap","date_system":"1900"}

{"sheet":"K-Z","index":0,"n_rows":48,"n_cols":14,"rows_kept":48,"cut":false,"hidden":false,"merged":[[44,0,46,1],[32,13,33,13],[35,13,36,13],[42,0,43,1],[31,0,31,1],[37,6,37,9],[34,0,34,1],[39,0,39,1],[40,0,41,1],[37,2,37,5],[37,0,37,1],[29,7,29,9],[31,8,31,9],[29,0,29,1],[0,0,1,0],[0,9,0,10],[0,4,0,5],[1,4,1,5],[1,6,1,7],[0,6,0,7]],"read":"row_number_cap"}
[2023,"Dolar :",{"$f":"VALUE(RIGHT(Anlık!A26,(LEN(Anlık!A26)-6)))","v":26.982900000000001},"GÜNCEL LOT","TOPLAM TUTAR",null,"GÜNCEL TUTAR",null,"BUGÜN  K/ Z","TOPLAM KAR / ZARAR",null,"TOPLAM MALİYET",{"$f":"(N2-L2)/L2","v":0.44732099930531871},"TOPLAM VARLIK"]
[null,"Altın :",{"$f":"VALUE(RIGHT(Anlık!A23,(LEN(Anlık!A23)-11)))","v":1669.16},{"$f":"SUM(D4:D30)","v":933},{"$f":"SUM(F4:F30)","v":23842.603000000003},null,{"$f":"SUM(I4:I30)","v":34507.899999999994},null,{"$f":"J2-OFFSET(GRAFIK!B1,COUNTA(GRAFIK!B:B)-1,0)","v":749.65699999999197},{"$f":"G2-E2","v":10665.296999999991},{"$f":"J2/E2","v":0.44732099930531871},{"$f":"E2+L33+L36","v":23842.603000000003},{"$f":"N2-L2","v":10665.296999999991},{"$f":"G2++N33+N36","v":34507.899999999994}]
["DÜN K/Z ₺","BUGÜN KAZANÇ","HİSSE","GÜNCEL LOT","ORT. MALİYET","MALİYET TOPLAM","BUGÜN\nANLIK %","BUGÜN\nANLIK ₺","ANLIK TUTAR","K/Z\nTL","K/Z\n%","Portföy\n Oranı","DOLAR DA","ALTIN DA"]
[{"$f":"ROUNDDOWN(INDEX(GUNLUK!B:B,COUNTA(GUNLUK!B:B)),2)","v":6753.64},{"$f":"ROUNDDOWN(J4-A4,2)","v":704.11},"HALKA ARZ",{"$f":"HALKARZ!E2","v":300},{"$f":"F4/D4","v":22.908626666666667},{"$f":"HALKARZ!F2","v":6872.5879999999997},{"$f":"HALKARZ!L2","v":1.0851446354706553},{"$f":"I4/D4","v":47.767800000000001},{"$f":"HALKARZ!H2","v":14330.34},{"$f":"I4-F4","v":7457.7520000000004},{"$f":"HALKARZ!L2","v":1.0851446354706553},{"$f":"(F4/SUM($F$4:$F$23))","v":0.28824822524621152},{"$f":"(SUMIF(Kayıt!B:B,C4,Kayıt!H:H)*$C$1-F4)/F4","v":-1},{"$f":"(SUMIF(Kayıt!B:B,C4,Kayıt!I:I)*$C$2-F4)/F4","v":-1}]
[{"$f":"ROUNDDOWN(INDEX(GUNLUK!C:C,COUNTA(GUNLUK!C:C)),2)","v":143.19999999999999},{"$f":"ROUNDDOWN(J5-A5,2)","v":-5.99},"DOAS",{"$f":"SUMIF(Kayıt!B:B,C5,Kayıt!C:C)","v":4},235.3,{"$f":"SUMIF(Kayıt!B:B,C5,Kayıt!E:E)","v":941.2},{"$f":"VLOOKUP(C5,Anlık!A:F,6,FALSE)","v":-5.4999999999999997E-3},{"$f":"VLOOKUP(C5,Anlık!A:B,2,FALSE)","v":269.60000000000002},{"$f":"H5*D5","v":1078.4000000000001},137.20000000000005,{"$f":"(H5-E5)/E5","v":0.14577135571610714},{"$f":"(F5/SUM($F$4:$F$23))","v":3.9475555584262335E-2},{"$f":"(SUMIF(Kayıt!B:B,C5,Kayıt!H:H)*$C$1-F5)/F5","v":6.8246268656716536E-3},{"$f":"(SUMIF(Kayıt!B:B,C5,Kayıt!I:I)*$C$2-F5)/F5","v":-1.2331360946745482E-2}]
[{"$f":"ROUNDDOWN(INDEX(GUNLUK!D:D,COUNTA(GUNLUK!D:D)),2)","v":-12.08},18.190000000000001,"VESBE",{"$f":"SUMIF(Kayıt!B:B,C6,Kayıt!C:C)","v":65},16.206,{"$f":"SUMIF(Kayıt!B:B,C6,Kayıt!E:E)","v":1053.3899999999999},{"$f":"VLOOKUP(C6,Anlık!A:F,6,FALSE)","v":1.7500000000000002E-2},{"$f":"VLOOKUP(C6,Anlık!A:B,2,FALSE)","v":16.3},1059.5,6.1100000000001273,5.800320868814093E-3,4.4180998190507963E-2,{"$f":"(SUMIF(Kayıt!B:B,C6,Kayıt!H:H)*$C$1-F6)/F6","v":6.8246268656717195E-3},{"$f":"(SUMIF(Kayıt!B:B,C6,Kayıt!I:I)*$C$2-F6)/F6","v":-1.233136094674555E-2}]
[{"$f":"ROUNDDOWN(INDEX(GUNLUK!E:E,COUNTA(GUNLUK!E:E)),2)","v":371.74},3.75,"BRISA",{"$f":"SUMIF(Kayıt!B:B,C7,Kayıt!C:C)","v":15},65.617000000000004,{"$f":"SUMIF(Kayıt!B:B,C7,Kayıt!E:E)","v":984.25500000000011},{"$f":"VLOOKUP(C7,Anlık!A:F,6,FALSE)","v":2.8E-3},{"$f":"VLOOKUP(C7,Anlık!A:B,2,FALSE)","v":90.65},1359.75,375.49499999999989,0.38150174497462547,4.1281356737768941E-2,{"$f":"(SUMIF(Kayıt!B:B,C7,Kayıt!H:H)*$C$1-F7)/F7","v":6.8246268656716987E-3},{"$f":"(SUMIF(Kayıt!B:B,C7,Kayıt!I:I)*$C$2-F7)/F7","v":-1.2331360946745524E-2}]
[{"$f":"ROUNDDOWN(INDEX(GUNLUK!F:F,COUNTA(GUNLUK!F:F)),2)","v":183.68},-12.16,"NTGAZ",{"$f":"SUMIF(Kayıt!B:B,C8,Kayıt!C:C)","v":64},15.23,{"$f":"SUMIF(Kayıt!B:B,C8,Kayıt!E:E)","v":974.72},{"$f":"VLOOKUP(C8,Anlık!A:F,6,FALSE)","v":-1.0500000000000001E-2},{"$f":"VLOOKUP(C8,Anlık!A:B,2,FALSE)","v":17.91},1146.24,171.51999999999998,0.17596848325673012,4.0881442349226714E-2,{"$f":"(SUMIF(Kayıt!B:B,C8,Kayıt!H:H)*$C$1-F8)/F8","v":6.8246268656716128E-3},{"$f":"(SUMIF(Kayıt!B:B,C8,Kayıt!I:I)*$C$2-F8)/F8","v":-1.2331360946745548E-2}]
[{"$f":"ROUNDDOWN(INDEX(GUNLUK!G:G,COUNTA(GUNLUK!G:G)),2)","v":561.74},-32.99,"TUPRS",{"$f":"SUMIF(Kayıt!B:B,C9,Kayıt!C:C)","v":11},93.432000000000002,{"$f":"SUMIF(Kayıt!B:B,C9,Kayıt!E:E)","v":1027.752},{"$f":"VLOOKUP(C9,Anlık!A:F,6,FALSE)","v":-2.0799999999999999E-2},{"$f":"VLOOKUP(C9,Anlık!A:B,2,FALSE)","v":141.5},1556.5,528.74800000000005,0.51447041698775575,4.3105696135610688E-2,{"$f":"(SUMIF(Kayıt!B:B,C9,Kayıt!H:H)*$C$1-F9)/F9","v":6.8246268656716839E-3},{"$f":"(SUMIF(Kayıt!B:B,C9,Kayıt!I:I)*$C$2-F9)/F9","v":-1.2331360946745536E-2}]
[{"$f":"ROUNDDOWN(INDEX(GUNLUK!H:H,COUNTA(GUNLUK!H:H)),2)","v":526.29999999999995},59,"AKCNS",{"$f":"SUMIF(Kayıt!B:B,C10,Kayıt!C:C)","v":10},100.77,{"$f":"SUMIF(Kayıt!B:B,C10,Kayıt!E:E)","v":1007.6999999999999},{"$f":"VLOOKUP(C10,Anlık!A:F,6,FALSE)","v":3.85E-2},{"$f":"VLOOKUP(C10,Anlık!A:B,2,FALSE)","v":159.30000000000001},1593,585.30000000000007,0.58082762727002102,4.2264680580387966E-2,{"$f":"(SUMIF(Kayıt!B:B,C10,Kayıt!H:H)*$C$1-F10)/F10","v":6.8246268656717152E-3},{"$f":"(SUMIF(Kayıt!B:B,C10,Kayıt!I:I)*$C$2-F10)/F10","v":-1.2331360946745511E-2}]
[{"$f":"ROUNDDOWN(INDEX(GUNLUK!I:I,COUNTA(GUNLUK!I:I)),2)","v":223.46},-42,"ENJSA",{"$f":"SUMIF(Kayıt!B:B,C11,Kayıt!C:C)","v":20},41.127000000000002,{"$f":"SUMIF(Kayıt!B:B,C11,Kayıt!E:E)","v":822.54000000000008},{"$f":"VLOOKUP(C11,Anlık!A:F,6,FALSE)","v":-4.02E-2},{"$f":"VLOOKUP(C11,Anlık!A:B,2,FALSE)","v":50.2},1004,{"$f":"I11-F11","v":181.45999999999992},{"$f":"(H11-E11)/E11","v":0.22060933206895714},3.4498749989671847E-2,{"$f":"(SUMIF(Kayıt!B:B,C11,Kayıt!H:H)*$C$1-F11)/F11","v":6.8246268656716302E-3},{"$f":"(SUMIF(Kayıt!B:B,C11,Kayıt!I:I)*$C$2-F11)/F11","v":-1.2331360946745622E-2}]
[{"$f":"ROUNDDOWN(INDEX(GUNLUK!J:J,COUNTA(GUNLUK!J:J)),2)","v":138.49},-0.69,"ALKA",{"$f":"SUMIF(Kayıt!B:B,C12,Kayıt!C:C)","v":35},28.623000000000001,{"$f":"SUMIF(Kayıt!B:B,C12,Kayıt!E:E)","v":1001.8050000000001},{"$f":"VLOOKUP(C12,Anlık!A:F,6,FALSE)","v":-5.9999999999999995E-4},{"$f":"VLOOKUP(C12,Anlık!A:B,2,FALSE)","v":32.56},1139.6000000000001,137.79500000000007,0.13754672815567903,4.2017434086370514E-2,{"$f":"(SUMIF(Kayıt!B:B,C12,Kayıt!H:H)*$C$1-F12)/F12","v":6.8246268656716987E-3},{"$f":"(SUMIF(Kayıt!B:B,C12,Kayıt!I:I)*$C$2-F12)/F12","v":-1.233136094674543E-2}]
[{"$f":"ROUNDDOWN(INDEX(GUNLUK!K:K,COUNTA(GUNLUK!K:K)),2)","v":220.03},-43.04,"SISE",{"$f":"SUMIF(Kayıt!B:B,C13,Kayıt!C:C)","v":21},46.122,{"$f":"SUMIF(Kayıt!B:B,C13,Kayıt!E:E)","v":968.56200000000001},{"$f":"VLOOKUP(C13,Anlık!A:F,6,FALSE)","v":-3.6200000000000003E-2},{"$f":"VLOOKUP(C13,Anlık!A:B,2,FALSE)","v":54.55},1145.55,176.98799999999994,0.18273275226572996,4.0623165180412556E-2,{"$f":"(SUMIF(Kayıt!B:B,C13,Kayıt!H:H)*$C$1-F13)/F13","v":6.824626865671579E-3},{"$f":"(SUMIF(Kayıt!B:B,C13,Kayıt!I:I)*$C$2-F13)/F13","v":-1.2331360946745609E-2}]
[{"$f":"ROUNDDOWN(INDEX(GUNLUK!L:L,COUNTA(GUNLUK!L:L)),2)","v":696.93},25.2,"ISMEN",{"$f":"SUMIF(Kayıt!B:B,C14,Kayıt!C:C)","v":84},27.963166666666666,{"$f":"SUMIF(Kayıt!B:B,C14,Kayıt!E:E)","v":2348.9059999999999},{"$f":"VLOOKUP(C14,Anlık!A:F,6,FALSE)","v":8.3000000000000001E-3},{"$f":"VLOOKUP(C14,Anlık!A:B,2,FALSE)","v":36.56},3071.04,722.13400000000001,0.30743418425428698,9.8517179521044732E-2,{"$f":"(SUMIF(Kayıt!B:B,C14,Kayıt!H:H)*$C$1-F14)/F14","v":6.8246268656718453E-3},{"$f":"(SUMIF(Kayıt!B:B,C14,Kayıt!I:I)*$C$2-F14)/F14","v":-1.2331360946745333E-2}]
[{"$f":"ROUNDDOWN(INDEX(GUNLUK!M:M,COUNTA(GUNLUK!M:M)),2)","v":175.63},-0.53,"EREGL",{"$f":"SUMIF(Kayıt!B:B,C15,Kayıt!C:C)","v":27},37.515000000000001,{"$f":"SUMIF(Kayıt!B:B,C15,Kayıt!E:E)","v":1012.905},{"$f":"VLOOKUP(C15,Anlık!A:F,6,FALSE)","v":-5.0000000000000001E-4},{"$f":"VLOOKUP(C15,Anlık!A:B,2,FALSE)","v":44},1188,175.09500000000003,0.17286418765827,4.2482987281212539E-2,{"$f":"(SUMIF(Kayıt!B:B,C15,Kayıt!H:H)*$C$1-F15)/F15","v":6.8246268656716293E-3},{"$f":"(SUMIF(Kayıt!B:B,C15,Kayıt!I:I)*$C$2-F15)/F15","v":-1.233136094674557E-2}]
{"$rows_left_out":34}
{"sheet":"GUNLUK","index":1,"n_rows":2,"n_cols":19,"rows_kept":2,"cut":false,"hidden":false,"merged":[]}
["GÜN","HALKA ARZ","DOAS","VESBE","BRISA","NTGAZ","TUPRS","AKCNS","ENJSA","ALKA","SISE","ISMEN","EREGL","HEKTS","HUNER","ZOREN","BIOEN","ELITE","AKSEN"]
["2023-09-14",6753.6420000000016,143.20000000000005,-12.089999999999918,371.74499999999989,183.68000000000006,561.74800000000005,526.30000000000007,223.45999999999992,138.49499999999989,220.03800000000012,696.93399999999974,175.63500000000022,-52.42,-120.22999999999996,74.599999999999966,-30,93.100000000000136,-32.199999999999818]

{"sheet":"HALKARZ","index":2,"n_rows":53,"n_cols":14,"rows_kept":53,"cut":false,"hidden":false,"merged":[[0,10,0,11],[0,12,0,13],[1,0,1,1],[1,5,1,6],[1,7,1,8],[0,0,0,1],[0,5,0,6],[0,7,0,8]]}
["HALKA ARZ",null,"Dolar :",{"$f":"'K-Z'!C1","v":26.982900000000001},"GÜNCEL LOT","TOPLAM TUTAR",null,"GÜNCEL TUTAR",null,"TOPLAM ARZ K/ Z","TOPLAM KAR / ZARAR"]
["ALIM",null,"Altın :",{"$f":"'K-Z'!C2","v":1669.16},{"$f":"SUM(D4:D54)","v":300},{"$f":"SUM(F4:F54)","v":6872.5879999999997},null,{"$f":"SUM(I4:I54)","v":14330.34},null,{"$f":"H2-F2","v":7457.7520000000004},{"$f":"H2-F2","v":7457.7520000000004},{"$f":"IFERROR(K2/F2,\"0\")","v":1.0851446354706553}]
["GÜN","TARİH","HİSSE","GÜNCEL LOT","ORT. MALİYET","MALİYET TOPLAM","BUGÜN\nANLIK %","BUGÜN\nANLIK ₺","ANLIK TUTAR","K/Z\nTL","K/Z\n%","Portföy\n Oranı","AÇIKLAMA","TÜMETTÜ TARİH"]
[null,null,"KAYSE",39,18.106000000000002,{"$f":"IFERROR(D4*E4,)","v":706.13400000000001},{"$f":"IFERROR(VLOOKUP(C4,Anlık!A:F,6,FALSE),)","v":1.9199999999999998E-2},{"$f":"IFERROR(VLOOKUP(C4,Anlık!A:B,2,FALSE),)","v":44.64},{"$f":"H4*D4","v":1740.96},{"$f":"IFERROR(I4-F4,)","v":1034.826},{"$f":"IFERROR(I4/F4-1,)","v":1.4654810560035347},{"$f":"(F4/SUM($F$4:$F$54))","v":0.10274644718990866}]
[null,null,"KLSER",10,25,{"$f":"IFERROR(D5*E5,)","v":250},{"$f":"IFERROR(VLOOKUP(C5,Anlık!A:F,6,FALSE),)","v":9.9500000000000005E-2},{"$f":"IFERROR(VLOOKUP(C5,Anlık!A:B,2,FALSE),)","v":97.8},{"$f":"H5*D5","v":978},{"$f":"IFERROR(I5-F5,)","v":728},{"$f":"IFERROR(I5/F5-1,)","v":2.9119999999999999},{"$f":"(F5/SUM($F$4:$F$54))","v":3.6376398527017774E-2}]
[null,null,"FZLGY",51,8.9,453.90000000000003,{"$f":"IFERROR(VLOOKUP(C6,Anlık!A:F,6,FALSE),)","v":8.3000000000000001E-3},{"$f":"IFERROR(VLOOKUP(C6,Anlık!A:B,2,FALSE),)","v":18.149999999999999},{"$f":"H6*D6","v":925.65},471.74999999999994,1.0393258426966292,6.6044989165653475E-2]
[null,null,"ATAKP",14,39.5,553,{"$f":"IFERROR(VLOOKUP(C7,Anlık!A:F,6,FALSE),)","v":-1.9900000000000001E-2},{"$f":"IFERROR(VLOOKUP(C7,Anlık!A:B,2,FALSE),)","v":69},{"$f":"H7*D7","v":966},413,0.74683544303797467,8.0464593541763316E-2]
[null,null,"BIGCH",17,22.5,382.5,{"$f":"IFERROR(VLOOKUP(C8,Anlık!A:F,6,FALSE),)","v":-5.1499999999999997E-2},{"$f":"IFERROR(VLOOKUP(C8,Anlık!A:B,2,FALSE),)","v":37.6},{"$f":"H8*D8","v":639.20000000000005},256.70000000000005,0.67111111111111121,5.5655889746337187E-2]
[null,null,"SOKE",1,7.5,7.5,{"$f":"IFERROR(VLOOKUP(C9,Anlık!A:F,6,FALSE),)","v":5.4899999999999997E-2},{"$f":"IFERROR(VLOOKUP(C9,Anlık!A:B,2,FALSE),)","v":25},25,17.5,2.3333333333333335,1.091291955810533E-3]
[null,null,"ASGYO",52,12.6,655.19999999999993,{"$f":"IFERROR(VLOOKUP(C10,Anlık!A:F,6,FALSE),)","v":-1.21E-2},{"$f":"IFERROR(VLOOKUP(C10,Anlık!A:B,2,FALSE),)","v":21.24},1104.48,449.28000000000009,0.68571428571428594,9.5335265259608171E-2]
[null,null,"IZENR",51,29.294,1493.9939999999999,{"$f":"IFERROR(VLOOKUP(C11,Anlık!A:F,6,FALSE),)","v":0.1},{"$f":"IFERROR(VLOOKUP(C11,Anlık!A:B,2,FALSE),)","v":52.8},2692.7999999999997,1198.8059999999998,0.80241687717621346,0.21738448456389353]
[null,null,"OFSYM",16,27.2,435.2,{"$f":"IFERROR(VLOOKUP(C12,Anlık!A:F,6,FALSE),)","v":9.8299999999999998E-2},{"$f":"IFERROR(VLOOKUP(C12,Anlık!A:B,2,FALSE),)","v":77.099999999999994},1233.5999999999999,798.39999999999986,1.8345588235294117,6.3324034555832534E-2]
[null,null,"TATEN",23,22.5,{"$f":"D13*E13","v":517.5},{"$f":"IFERROR(VLOOKUP(C13,Anlık!A:F,6,FALSE),)","v":0.1},{"$f":"IFERROR(VLOOKUP(C13,Anlık!A:B,2,FALSE),)","v":58.3},1340.8999999999999,823.39999999999986,1.5911111111111107,7.529914495092678E-2]
[null,null,"ENERY",11,88.76,976.36,{"$f":"IFERROR(VLOOKUP(C14,Anlık!A:F,6,FALSE),)","v":9.98E-2},{"$f":"IFERROR(VLOOKUP(C14,Anlık!A:B,2,FALSE),)","v":169.7},1866.6999999999998,890.3399999999998,0.91189725101397001,0.14206584186335627]
[null,null,"BYDNR",5,21,{"$f":"IFERROR(D15*E15,)","v":105},{"$f":"IFERROR(VLOOKUP(C15,Anlık!A:F,6,FALSE),)","v":9.9500000000000005E-2},{"$f":"IFERROR(VLOOKUP(C15,Anlık!A:B,2,FALSE),)","v":51.15},{"$f":"H15*D15","v":255.75},{"$f":"IFERROR(I15-F15,)","v":150.75},{"$f":"IFERROR(I15/F15-1,)","v":1.4357142857142855},{"$f":"(F15/SUM($F$4:$F$54))","v":1.5278087381347463E-2}]
{"$rows_left_out":39}
{"sheet":"Kayıt","index":3,"n_rows":111,"n_cols":12,"rows_kept":111,"cut":false,"hidden":false,"merged":[[0,9,1,9],[0,10,1,10],[0,11,1,11]]}
[null,null,null,null,"ANLIK KUR >",{"$f":"'K-Z'!C1","v":26.982900000000001},{"$f":"'K-Z'!C2","v":1669.16},"DOLAR","ALTIN","Anlık Fiyat","Kar / Zarar\nTL","Kar / Zarar\n%"]
["Tarih","Hisse","Alış Lot","Birim Fiyat","Toplam Tutar","Dolar Kuru","Altın Kuru","Dolar Alsaydık","Altın Alsaydık"]
["2023-07-28","DOAS",4,235.3,{"$f":"IF(C3,D3*C3,\"\")","v":941.2},26.8,1690,{"$f":"IF(F3,E3/F3,\"\")","v":35.119402985074629},{"$f":"IF(G3,E3/G3,\"\")","v":0.55692307692307697},{"$f":"VLOOKUP(B3,Anlık!A:B,2,FALSE)","v":269.60000000000002},{"$f":"IF(J3,J3*C3-E3,\"\")","v":137.20000000000005},{"$f":"J3/D3-1","v":0.14577135571610711}]
["2023-07-28","VESBE",65,16.206,1053.3899999999999,26.8,1690,39.305597014925368,0.62330769230769223,{"$f":"VLOOKUP(B4,Anlık!A:B,2,FALSE)","v":16.3},6.1100000000001273,5.8003208688139907E-3]
["2023-07-28","BRISA",15,65.617000000000004,984.25500000000011,26.8,1690,36.725932835820899,0.5823994082840237,{"$f":"VLOOKUP(B5,Anlık!A:B,2,FALSE)","v":90.65},375.49499999999989,0.38150174497462541]
["2023-07-28","NTGAZ",64,15.23,974.72,26.8,1690,36.370149253731341,0.57675739644970414,{"$f":"VLOOKUP(B6,Anlık!A:B,2,FALSE)","v":17.91},171.51999999999998,0.17596848325673009]
["2023-07-28","TUPRS",11,93.432000000000002,1027.752,26.8,1690,38.348955223880594,0.60813727810650886,{"$f":"VLOOKUP(B7,Anlık!A:B,2,FALSE)","v":141.5},528.74800000000005,0.51447041698775586]
["2023-07-28","AKCNS",10,100.77,1007.6999999999999,26.8,1690,37.600746268656714,0.59627218934911241,{"$f":"VLOOKUP(B8,Anlık!A:B,2,FALSE)","v":159.30000000000001},585.30000000000007,0.58082762727002102]
["2023-07-28","ENJSA",20,41.127000000000002,822.54000000000008,26.8,1690,30.691791044776121,0.48671005917159765,{"$f":"VLOOKUP(B9,Anlık!A:B,2,FALSE)","v":50.2},181.45999999999992,0.22060933206895705]
["2023-07-28","ALKA",35,28.623000000000001,1001.8050000000001,26.8,1690,37.380783582089556,0.59278402366863914,{"$f":"VLOOKUP(B10,Anlık!A:B,2,FALSE)","v":32.56},137.79500000000007,0.13754672815567903]
["2023-07-28","SISE",21,46.122,968.56200000000001,26.8,1690,36.140373134328357,0.5731136094674556,{"$f":"VLOOKUP(B11,Anlık!A:B,2,FALSE)","v":54.55},176.98799999999994,0.18273275226573005]
["2023-07-28","ISMEN",49,20.494,1004.206,26.8,1690,37.470373134328355,0.59420473372781069,{"$f":"VLOOKUP(B12,Anlık!A:B,2,FALSE)","v":36.56},787.23400000000004,0.78393676197911599]
["2023-07-28","EREGL",27,37.515000000000001,1012.905,26.8,1690,37.79496268656716,0.59935207100591714,{"$f":"VLOOKUP(B13,Anlık!A:B,2,FALSE)","v":44},175.09500000000003,0.17286418765826994]
["2023-07-28","HEKTS",2,51.25,102.5,26.8,1690,3.8246268656716418,6.0650887573964495E-2,{"$f":"VLOOKUP(B14,Anlık!A:B,2,FALSE)","v":24.64},-53.22,-0.51921951219512197]
["2023-07-28","HUNER",55,10.596,582.78,26.8,1690,21.745522388059701,0.34484023668639052,{"$f":"VLOOKUP(B15,Anlık!A:B,2,FALSE)","v":8.42},-119.67999999999995,-0.20536051340128347]
{"$rows_left_out":97}
{"sheet":"AltınDolar","index":4,"n_rows":144,"n_cols":11,"rows_kept":144,"cut":false,"hidden":false,"merged":[[0,9,1,9],[0,10,1,10]]}
[null,null,null,null,"ANLIK KUR >",{"$f":"'K-Z'!C1","v":26.982900000000001},{"$f":"'K-Z'!C2","v":1669.16},"DOLAR","ALTIN","DOLAR K/Z","ALTIN K/Z"]
["Tarih","EMTİA","Alış Adet","Birim Fiyat","Toplam Tutar","Dolar Kuru","Altın Kuru","Dolar Alsaydık","Altın Alsaydık"]
["2019-01-01","VAKIFBANK ALTIN",0,0,{"$f":"IF(C3,D3*C3,\"\")","v":""},5.92,278.22000000000003,{"$f":"IF(F3,E3/F3,\"\")","v":{"$error":"#VALUE!"}},{"$f":"IF(G3,E3/G3,\"\")","v":{"$error":"#VALUE!"}},{"$f":"H3*$F$1-E3","v":{"$error":"#VALUE!"}},{"$f":"I3*$G$1-E3","v":{"$error":"#VALUE!"}}]
["2022-03-16","HALKBANK DOLAR",0,0,"",13.77,817.21,{"$error":"#VALUE!"},{"$error":"#VALUE!"},{"$f":"H4*$F$1-E4","v":{"$error":"#VALUE!"}},{"$f":"I4*$G$1-E4","v":{"$error":"#VALUE!"}}]
["2022-03-16","HALKBANK ALTIN",0,0,"",13.77,817.21,{"$error":"#VALUE!"},{"$error":"#VALUE!"},{"$error":"#VALUE!"},{"$error":"#VALUE!"}]
[null,null,null,null,"",null,null,"","",{"$error":"#VALUE!"},{"$error":"#VALUE!"}]
[null,null,null,null,"",null,null,"","",{"$error":"#VALUE!"},{"$error":"#VALUE!"}]
[null,null,null,null,"",null,null,"","",{"$error":"#VALUE!"},{"$error":"#VALUE!"}]
[null,null,null,null,"",null,null,"","",{"$error":"#VALUE!"},{"$error":"#VALUE!"}]
[null,null,null,null,"",null,null,"","",{"$error":"#VALUE!"},{"$error":"#VALUE!"}]
[null,null,null,null,"",null,null,"","",{"$error":"#VALUE!"},{"$error":"#VALUE!"}]
[null,null,null,null,"",null,null,"","",{"$error":"#VALUE!"},{"$error":"#VALUE!"}]
[null,null,null,null,"",null,null,"","",{"$error":"#VALUE!"},{"$error":"#VALUE!"}]
[null,null,null,null,"",null,null,"","",{"$error":"#VALUE!"},{"$error":"#VALUE!"}]
[null,null,null,null,"",null,null,"","",{"$error":"#VALUE!"},{"$error":"#VALUE!"}]
{"$rows_left_out":130}
{"sheet":"GRAFIK","index":5,"n_rows":74,"n_cols":12,"rows_kept":74,"cut":false,"hidden":false,"merged":[[0,1,0,3],[0,4,0,6],[0,7,0,8],[0,0,1,0],[0,9,0,11]]}
["GÜN","ALSAYDIM",null,null,"YÜZDELİK KAR- ZARAR",null,null,"GÜNLÜK EMTİA FİYATI",null,"BORSA\nNET "]
[null,"HİSSE K-Z","DOLAR K-Z","ALTIN K-Z","HİSSE %","DOLAR %","ALTIN %","DOLAR TL","ALTIN TL","GÜNLÜK K-Z","GÜNCEL TUTAR","K/Z \nORAN"]
["2023-06-29",1145.32,1164.48,964.99,0.20772700652586679,0.21120237258602165,0.17501953598259332,26,1500,{"$f":"IF(B3,B3-B2,\"\")","v":{"$error":"#VALUE!"}},5513.6,6658.92]
["2023-07-30",1593.85,-1.99,0,0.1044959222835294,-1.3020833333349038E-4,0,26.88,1694.58,{"$f":"IF(B4,B4-B3,\"\")","v":448.53},15252.78,16846.63]
["2023-07-31",2426.16,78.88,102.89,0.1590636905004251,5.1716417910448072E-3,6.7455621301777107E-3,26.94,1701.4,{"$f":"IF(B5,B5-B4,\"\")","v":832.31},15252.78,17678.939999999999]
["2023-08-01",2722.04,1774.8,1631.04,0.17846212529036515,0.11635884717690542,0.1069337662176256,26.96,1685.83,295.88000000000011,15252.78,17974.82]
["2023-08-02",3179.92,1772.46,1549.61,0.20848157683023888,0.11620564621499464,0.10159552243305103,26.96,1677.7,457.88000000000011,15252.78,18432.7]
["2023-08-04",4445.5,118.98,-61.36,0.2627990685965107,7.0335820895523838E-3,-3.6272189349112701E-3,26.99,1683.87,1265.58,16915.98,21361.48]
["2023-08-07",5128.26,121,-118.11,0.30316091113152965,7.1529850746271462E-3,-6.9822485207099716E-3,26.99,1678.2,682.76000000000022,16915.98,22044.240000000002]
["2023-08-08",5531.41,137.79,-157.65,0.32699340983970343,8.1455223880597255E-3,-9.3195266272188063E-3,27.02,1674.25,403.14999999999964,16915.98,22447.39]
["2023-08-09",6132.75,104.15,-250.54,0.36254205122175331,6.1567164179105183E-3,-1.4810650887573966E-2,26.97,1664.97,601.34000000000015,16915.98,23048.73]
["2023-08-11",5693.21,160.88999999999999,-260.14999999999998,0.33655833180667033,9.5111940298508568E-3,-1.5378698224852072E-2,27.05,1664.01,-439.53999999999996,16915.98,22609.19]
["2023-08-12",6337.05,104.4,-259.33999999999997,0.37461939088708879,6.1716417910447829E-3,-1.5331360946745492E-2,26.97,1664.09,643.84000000000015,16915.98,23253.03]
["2023-08-15",6846.42,163.72999999999999,-307.58999999999997,0.3816192821732971,9.6791044776120324E-3,-1.8183431952662716E-2,27.06,1659.27,509.36999999999989,16915.98,23371.439999999999]
["2023-08-16",7952.73,696.87,52.59,0.44095674802637114,3.8639244838142704E-2,2.9157065362620752E-3,27.06,1647.65,1106.3099999999995,18035.18,25987.91]
{"$rows_left_out":60}
{"sheet":"Temettü","index":6,"n_rows":23,"n_cols":15,"rows_kept":23,"cut":false,"hidden":false,"merged":[[0,0,1,1],[15,5,16,6],[15,7,16,8],[15,9,16,14],[0,3,0,4],[0,5,0,6],[0,8,0,9],[1,3,1,4],[1,5,1,6],[1,8,1,9]]}
["TEMETTÜ GELİRİ",null,"GÜNCEL LOT","MALİYET",null,"MALİYET-TMT-SIFIR MLYT",null,"TEMETTÜ","SIFIR MALİYETLER",null,"ANLIK TUTAR","KAR / ZARAR","NET K / Z","Anlık %\n K / Z","NET MALİYETE GÖRE"]
[null,null,{"$f":"SUM(C4:C15)","v":489},{"$f":"SUM(F4:F15)","v":13684.145000000002},null,{"$f":"SUM(G4:G15)","v":{"$error":"#VALUE!"}},null,{"$f":"H16","v":371.30299999999994},{"$f":"SUM(J4:J15)","v":33.65},null,{"$f":"SUM(K4:K15)","v":23127.73},{"$f":"SUM(L4:L15)","v":{"$error":"#VALUE!"}},{"$f":"SUM(M4:M15)","v":{"$error":"#VALUE!"}},{"$f":"'K-Z'!K2","v":0.44732099930531871},{"$f":"K2/F2-1","v":{"$error":"#VALUE!"}}]
["SIRA","HİSSE ADI","Güncel Lot","Ort. Lot\nMaliyet","Net Lot\nMaliyet","Toplam Maliyet","Net \nMaliyet","Temettü Gelir","Sıfır Lot","Sıfır Maliyet","Anlık Tutar","Genel \nKar / Zarar","Net\n Kar / Zarar","Genel %\nKar / Zarar  ","Net % \nKar / Zarar"]
[1,{"$f":"'K-Z'!C4","v":"HALKA ARZ"},{"$f":"'K-Z'!D4","v":300},{"$f":"'K-Z'!E4","v":22.908626666666667},{"$f":"G4/C4","v":22.908626666666667},{"$f":"'K-Z'!F4","v":6872.5879999999997},{"$f":"F4-H4-J4","v":6872.5879999999997},{"$f":"SUMIF($B$19:$B$1000,B4,$F$19:$F$999)","v":0},{"$f":"SUMIF($J$19:$J$1000,B4,$L$19:$L$999)","v":0},{"$f":"SUMIF($J$19:$J$1000,B4,$N$19:$N$999)","v":0},{"$f":"'K-Z'!I4","v":14330.34},{"$f":"K4-F4","v":7457.7520000000004},{"$f":"K4-G4","v":7457.7520000000004},{"$f":"K4/F4-1","v":1.0851446354706553},{"$f":"K4/G4-1","v":1.0851446354706553}]
[2,{"$f":"'K-Z'!C5","v":"DOAS"},{"$f":"'K-Z'!D5","v":4},{"$f":"'K-Z'!E5","v":235.3},{"$f":"G5/C5","v":235.3},{"$f":"'K-Z'!F5","v":941.2},{"$f":"F5-H5-J5","v":941.2},0,0,0,{"$f":"'K-Z'!I5","v":1078.4000000000001},{"$f":"K5-F5","v":137.20000000000005},{"$f":"K5-G5","v":137.20000000000005},{"$f":"K5/F5-1","v":0.14577135571610711},{"$f":"K5/G5-1","v":0.14577135571610711}]
[3,{"$f":"'K-Z'!C6","v":"VESBE"},{"$f":"'K-Z'!D6","v":65},{"$f":"'K-Z'!E6","v":16.206},15.751384615384614,{"$f":"'K-Z'!F6","v":1053.3899999999999},1023.8399999999999,0,3,29.549999999999997,{"$f":"'K-Z'!I6","v":1059.5},6.1100000000001273,35.660000000000082,5.8003208688142127E-3,3.4829660884513336E-2]
[4,{"$f":"'K-Z'!C7","v":"BRISA"},{"$f":"'K-Z'!D7","v":15},{"$f":"'K-Z'!E7","v":65.617000000000004},65.617000000000004,{"$f":"'K-Z'!F7","v":984.25500000000011},984.25500000000011,0,0,0,{"$f":"'K-Z'!I7","v":1359.75},375.49499999999989,375.49499999999989,0.38150174497462541,0.38150174497462541]
[5,{"$f":"'K-Z'!C8","v":"NTGAZ"},{"$f":"'K-Z'!D8","v":64},{"$f":"'K-Z'!E8","v":15.23},15.23,{"$f":"'K-Z'!F8","v":974.72},974.72,0,0,0,{"$f":"'K-Z'!I8","v":1146.24},171.51999999999998,171.51999999999998,0.17596848325673009,0.17596848325673009]
[6,{"$f":"'K-Z'!C9","v":"TUPRS"},{"$f":"'K-Z'!D9","v":11},{"$f":"'K-Z'!E9","v":93.432000000000002},93.432000000000002,{"$f":"'K-Z'!F9","v":1027.752},1027.752,0,0,0,{"$f":"'K-Z'!I9","v":1556.5},528.74800000000005,528.74800000000005,0.51447041698775586,0.51447041698775586]
[7,{"$f":"'K-Z'!C10","v":"AKCNS"},{"$f":"'K-Z'!D10","v":10},{"$f":"'K-Z'!E10","v":100.77},100.77,{"$f":"'K-Z'!F10","v":1007.6999999999999},1007.6999999999999,0,0,0,{"$f":"'K-Z'!I10","v":1593},585.30000000000007,585.30000000000007,0.58082762727002102,0.58082762727002102]
[8,{"$f":"'K-Z'!C11","v":"ENJSA"},{"$f":"'K-Z'!D11","v":20},{"$f":"'K-Z'!E11","v":41.127000000000002},37.406600000000005,{"$f":"'K-Z'!F11","v":822.54000000000008},748.13200000000006,70.308000000000007,0.1461675579322638,4.0999999999999996,{"$f":"'K-Z'!I11","v":1004},181.45999999999992,255.86799999999994,0.22060933206895705,0.3420091641581966]
[9,{"$f":"'K-Z'!C26","v":0},{"$f":"'K-Z'!D26","v":0},{"$f":"'K-Z'!E26","v":0},{"$error":"#DIV/0!"},{"$f":"'K-Z'!F26","v":0},0,0,0,0,{"$f":"'K-Z'!I26","v":0},0,0,{"$error":"#DIV/0!"},{"$error":"#DIV/0!"}]
[10,{"$f":"'K-Z'!C27","v":0},{"$f":"'K-Z'!D27","v":0},{"$f":"'K-Z'!E27","v":0},{"$error":"#DIV/0!"},{"$f":"'K-Z'!F27","v":0},0,0,0,0,{"$f":"'K-Z'!I27","v":0},0,0,{"$error":"#DIV/0!"},{"$error":"#DIV/0!"}]
[11,{"$f":"'K-Z'!C28","v":0},{"$f":"'K-Z'!D28","v":0},{"$f":"'K-Z'!E28","v":0},{"$error":"#DIV/0!"},{"$f":"'K-Z'!F28","v":0},0,0,0,0,{"$f":"'K-Z'!I28","v":0},0,0,{"$error":"#DIV/0!"},{"$error":"#DIV/0!"}]
[12,{"$f":"'K-Z'!C30","v":0},{"$f":"'K-Z'!D30","v":"TP TUTAR"},{"$f":"'K-Z'!E30","v":"TP K / Z"},{"$error":"#VALUE!"},{"$f":"'K-Z'!F30","v":"TP K/ Z %"},{"$error":"#VALUE!"},0,0,0,{"$f":"'K-Z'!I30","v":0},{"$error":"#VALUE!"},{"$error":"#VALUE!"},{"$error":"#VALUE!"},{"$error":"#VALUE!"}]
{"$rows_left_out":9}
{"sheet":"Anlık","index":7,"n_rows":1142,"n_cols":7,"rows_kept":1142,"cut":false,"hidden":false,"merged":[]}
["Döviz"]
["Kapalıçarşı"]
["Altın"]
["Emtia"]
["Pariteler"]
["Kripto Paralar"]
["Borsa"]
["Hisseler"]
["Borsa Yatırım Fonları"]
["Endeksler"]
["Akaryakıt"]
["Haberler"]
["Gündem"]
["Borsa"]
["Döviz"]
{"$rows_left_out":1127}